Target
Amine oxidase [flavin-containing] B
Ligand
BDBM50273595
Substrate
Meas. Tech.
ChEMBL_536002 (CHEMBL988018)
Ki
20±n/a nM
Citation
 La Regina, GSilvestri, RGatti, VLavecchia, ANovellino, EBefani, OTurini, PAgostinelli, E Synthesis, structure-activity relationships and molecular modeling studies of new indole inhibitors of monoamine oxidases A and B. Bioorg Med Chem 16:9729-40 (2008)  
Target
Name:
Amine oxidase [flavin-containing] B
Synonyms:
AOFB_BOVIN MAO-B Monoamine Oxidase Type B (MAO-B) Monoamine oxidase B | Monoamine oxidase type B
Type:
PROTEIN
Mol. Mass.:
58428.94
Organism:
Bos taurus
Description:
ChEMBL_1501478
Residue:
520
  
Inhibitor
Name:
BDBM50273595
Synonyms:
CHEMBL462097 | N-(1H-Indol-2-ylmethyl)-N-methyl-N-(2-phenethyl)amine
Type:
Small organic molecule
Emp. Form.:
C18H20N2
Mol. Mass.:
264.3648
SMILES:
CN(CCc1ccccc1)Cc1cc2ccccc2[nH]1
: