Target
Amine oxidase [flavin-containing] A
Ligand
BDBM50273625
Substrate
Meas. Tech.
ChEMBL_536001 (CHEMBL988017)
Ki
10000±n/a nM
Citation
 La Regina, GSilvestri, RGatti, VLavecchia, ANovellino, EBefani, OTurini, PAgostinelli, E Synthesis, structure-activity relationships and molecular modeling studies of new indole inhibitors of monoamine oxidases A and B. Bioorg Med Chem 16:9729-40 (2008)  
Target
Name:
Amine oxidase [flavin-containing] A
Synonyms:
AOFA_BOVIN MAO-A Monoamine Oxidase Type A (MAO-A) Monoamine oxidase A | Monoamine oxidase type A
Type:
PROTEIN
Mol. Mass.:
59764.63
Organism:
Bos taurus
Description:
ChEMBL_1501477
Residue:
527
  
Inhibitor
Name:
BDBM50273625
Synonyms:
(R,S)-N-(1H-Indol-2-ylmethyl)-N-(alpha-phenylethyl)amine | CHEMBL448946
Type:
Small organic molecule
Emp. Form.:
C17H18N2
Mol. Mass.:
250.3382
SMILES:
CC(NCc1cc2ccccc2[nH]1)c1ccccc1
: