Target
Amine oxidase [flavin-containing] A
Ligand
BDBM50273532
Substrate
Meas. Tech.
ChEMBL_536001 (CHEMBL988017)
Ki
100±n/a nM
Citation
 La Regina, GSilvestri, RGatti, VLavecchia, ANovellino, EBefani, OTurini, PAgostinelli, E Synthesis, structure-activity relationships and molecular modeling studies of new indole inhibitors of monoamine oxidases A and B. Bioorg Med Chem 16:9729-40 (2008)  
Target
Name:
Amine oxidase [flavin-containing] A
Synonyms:
AOFA_BOVIN MAO-A Monoamine Oxidase Type A (MAO-A) Monoamine oxidase A | Monoamine oxidase type A
Type:
PROTEIN
Mol. Mass.:
59764.63
Organism:
Bos taurus
Description:
ChEMBL_1501477
Residue:
527
  
Inhibitor
Name:
BDBM50273532
Synonyms:
CHEMBL507759 | N-(3-Phenylpropyl)-1-methyl-1H-indole-2-carboxamide
Type:
Small organic molecule
Emp. Form.:
C19H20N2O
Mol. Mass.:
292.3749
SMILES:
Cn1c(cc2ccccc12)C(=O)NCCCc1ccccc1
: