Target
Histamine H3 receptor
Ligand
BDBM50246434
Substrate
Meas. Tech.
ChEMBL_558277 (CHEMBL956577)
IC50
0.25±n/a nM
Citation
 Mizutani, TNagase, TIto, SMiyamoto, YTanaka, TTakenaga, NTokita, SSato, N Development of novel 2-[4-(aminoalkoxy)phenyl]-4(3H)-quinazolinone derivatives as potent and selective histamine H3 receptor inverse agonists. Bioorg Med Chem Lett 18:6041-5 (2008)  
Target
Name:
Histamine H3 receptor
Synonyms:
G-protein coupled receptor 97 HH3R HRH3 Histamine H3 receptor (H3) Histamine receptor (H3 and H4)
Type:
G Protein-Coupled Receptor (GPCR)
Mol. Mass.:
48691.47
Organism:
Homo sapiens (Human)
Description:
Binding assays were using CHO cells stably expressing hH3R receptors.
Residue:
445
  
Inhibitor
Name:
BDBM50246434
Synonyms:
2-(4-(1-cyclobutylpiperidin-4-yloxy)phenyl)-8-fluoro-3-methylquinazolin-4(3H)-one | CHEMBL454642
Type:
Small organic molecule
Emp. Form.:
C24H26FN3O2
Mol. Mass.:
407.4805
SMILES:
Cn1c(nc2c(F)cccc2c1=O)-c1ccc(OC2CCN(CC2)C2CCC2)cc1
: