Target
Histamine H3 receptor
Ligand
BDBM50246383
Substrate
Meas. Tech.
ChEMBL_558277 (CHEMBL956577)
IC50
0.7±n/a nM
Citation
 Mizutani, TNagase, TIto, SMiyamoto, YTanaka, TTakenaga, NTokita, SSato, N Development of novel 2-[4-(aminoalkoxy)phenyl]-4(3H)-quinazolinone derivatives as potent and selective histamine H3 receptor inverse agonists. Bioorg Med Chem Lett 18:6041-5 (2008)  
Target
Name:
Histamine H3 receptor
Synonyms:
G-protein coupled receptor 97 HH3R HRH3 Histamine H3 receptor (H3) Histamine receptor (H3 and H4)
Type:
G Protein-Coupled Receptor (GPCR)
Mol. Mass.:
48691.47
Organism:
Homo sapiens (Human)
Description:
Binding assays were using CHO cells stably expressing hH3R receptors.
Residue:
445
  
Inhibitor
Name:
BDBM50246383
Synonyms:
2-(4-(1-cyclobutylpiperidin-4-yloxy)phenyl)-3-methyl-8-(trifluoromethyl)quinazolin-4(3H)-one | CHEMBL453894
Type:
Small organic molecule
Emp. Form.:
C25H26F3N3O2
Mol. Mass.:
457.488
SMILES:
Cn1c(nc2c(cccc2c1=O)C(F)(F)F)-c1ccc(OC2CCN(CC2)C2CCC2)cc1
: