Target
Potassium voltage-gated channel subfamily H member 2
Ligand
BDBM50246244
Substrate
Meas. Tech.
ChEMBL_558278 (CHEMBL956578)
IC50
3000±n/a nM
Citation
 Mizutani, TNagase, TIto, SMiyamoto, YTanaka, TTakenaga, NTokita, SSato, N Development of novel 2-[4-(aminoalkoxy)phenyl]-4(3H)-quinazolinone derivatives as potent and selective histamine H3 receptor inverse agonists. Bioorg Med Chem Lett 18:6041-5 (2008)  
Target
Name:
Potassium voltage-gated channel subfamily H member 2
Synonyms:
1,3-beta-glucan synthase component GLS2 ERG Eag-related protein 1 Ether-a-go-go-related gene (HERG) Ether-a-go-go-related gene potassium channel 1 Ether-a-go-go-related gene potassium channel 1 (hERG1) Ether-a-go-go-related protein 1 H-ERG KCNH2 Potassium voltage-gated channel subfamily H member 2 (hERG) Voltage-gated potassium channel subunit Kv11.1 hERG Potassium Channel 1 | putative potassium channel subunit
Type:
Multi-pass membrane protein
Mol. Mass.:
126672.65
Organism:
Homo sapiens (Human)
Description:
Q12809
Residue:
1159
  
Inhibitor
Name:
BDBM50246244
Synonyms:
3-isopropyl-2-(4-(3-(piperidin-1-yl)propoxy)phenyl)quinazolin-4(3H)-one | CHEMBL488251
Type:
Small organic molecule
Emp. Form.:
C25H31N3O2
Mol. Mass.:
405.5325
SMILES:
CC(C)n1c(nc2ccccc2c1=O)-c1ccc(OCCCN2CCCCC2)cc1
: