Target
cGMP-specific 3',5'-cyclic phosphodiesterase
Ligand
BDBM50246105
Substrate
Meas. Tech.
ChEMBL_558442 (CHEMBL963848)
IC50
29±n/a nM
Citation
 Kim, YHChoi, HLee, JHwang, ICMoon, SKKim, SJLee, HWIm, DSLee, SSAhn, SKKim, SWHan, CKYoon, JHLee, KJChoi, NS Quinazolines as potent and highly selective PDE5 inhibitors as potential therapeutics for male erectile dysfunction. Bioorg Med Chem Lett 18:6279-82 (2008)  
Target
Name:
cGMP-specific 3',5'-cyclic phosphodiesterase
Synonyms:
PDE5 PDE5A_BOVIN | Phosphodiesterase 5A
Type:
PROTEIN
Mol. Mass.:
98615.45
Organism:
Bos taurus
Description:
ChEMBL_155186
Residue:
865
  
Inhibitor
Name:
BDBM50246105
Synonyms:
CHEMBL471528 | N-(4-(3-chloro-4-methoxybenzylamino)-7-methoxy-8-propylquinazolin-6-yl)-2-aminoacetamide
Type:
Small organic molecule
Emp. Form.:
C22H26ClN5O3
Mol. Mass.:
443.927
SMILES:
CCCc1c(OC)c(NC(=O)CN)cc2c(NCc3ccc(OC)c(Cl)c3)ncnc12
: