Target
Gag polyprotein
Ligand
BDBM50273883
Substrate
Meas. Tech.
ChEMBL_536774 (CHEMBL984568)
IC50
1400±n/a nM
Citation
 LaFrate, ALGunther, JRCarlson, KEKatzenellenbogen, JA Synthesis and biological evaluation of guanylhydrazone coactivator binding inhibitors for the estrogen receptor. Bioorg Med Chem 16:10075-84 (2008)  
Target
Name:
Gag polyprotein
Synonyms:
GAG_AVIER | gag
Type:
PROTEIN
Mol. Mass.:
61664.68
Organism:
Avian erythroblastosis virus (strain ES4)
Description:
ChEMBL_536774
Residue:
555
  
Inhibitor
Name:
BDBM50273883
Synonyms:
CHEMBL460174 | beta-Chloro-alpha-methylcinnamaldehyde guanylhydrazone
Type:
Small organic molecule
Emp. Form.:
C11H13ClN4
Mol. Mass.:
236.701
SMILES:
[#6]-[#6](-[#6]=[#7]\[#7]=[#6](\[#7])-[#7])=[#6](Cl)-c1ccccc1
: