Target
Cannabinoid receptor 1
Ligand
BDBM50256317
Substrate
Meas. Tech.
ChEMBL_519285 (CHEMBL947737)
Ki
1±n/a nM
Citation
 Kai, HMorioka, YKoriyama, YOkamoto, KHasegawa, YHattori, MKoike, KChiba, HShinohara, SIwamoto, YTakahashi, KTanimoto, N 2-Arylimino-5,6-dihydro-4H-1,3-thiazines as a new class of cannabinoid receptor agonists. Part 3: Synthesis and activity of isosteric analogs. Bioorg Med Chem Lett 18:6444-7 (2008)  
Target
Name:
Cannabinoid receptor 1
Synonyms:
CANN6 CB-R CNR CNR1_HUMAN Cannabinoid receptor Cannabinoid receptor 1 (brain)
Type:
G Protein-Coupled Receptor (GPCR)
Mol. Mass.:
52868.96
Organism:
Homo sapiens (Human)
Description:
P21554
Residue:
472
  
Inhibitor
Name:
BDBM50256317
Synonyms:
CHEMBL511790 | methyl 3-(4-tert-butylthiazol-2-ylimino)-2-oxa-4-azaspiro[5.5]undecane-4-carbodithioate
Type:
Small organic molecule
Emp. Form.:
C18H27N3OS3
Mol. Mass.:
397.621
SMILES:
CSC(=S)N1CC2(CCCCC2)CO\C1=N/c1nc(cs1)C(C)(C)C
: