Target
Dipeptidyl peptidase 8
Ligand
BDBM50256618
Substrate
Meas. Tech.
ChEMBL_515046 (CHEMBL1034788)
IC50
4265±n/a nM
Citation
 Ahn, JHPark, WSJun, MAShin, MSKang, SKKim, KYRhee, SDBae, MAKim, KRKim, SGKim, SYSohn, SKKang, NSLee, JOLee, DHCheon, HGKim, SS Synthesis and biological evaluation of homopiperazine derivatives with beta-aminoacyl group as dipeptidyl peptidase IV inhibitors. Bioorg Med Chem Lett 18:6525-9 (2008)  
Target
Name:
Dipeptidyl peptidase 8
Synonyms:
DPP8 DPRP-1 Dipeptidyl peptidase 8 (DPP-8) Dipeptidyl peptidase 8/9 Dipeptidyl peptidase VIII Prolyl dipeptidase DPP8
Type:
Enzyme
Mol. Mass.:
103342.62
Organism:
Homo sapiens (Human)
Description:
Q6V1X1
Residue:
898
  
Inhibitor
Name:
BDBM50256618
Synonyms:
(R)-3-(4-(3-amino-4-(2,4,5-trifluorophenyl)butanoyl)-1,4-diazepane-1-carbonyl)benzoic acid hydrochloride | CHEMBL475654
Type:
Small organic molecule
Emp. Form.:
C23H24F3N3O4
Mol. Mass.:
463.4496
SMILES:
N[C@@H](CC(=O)N1CCCN(CC1)C(=O)c1cccc(c1)C(O)=O)Cc1cc(F)c(F)cc1F
: