Target
Prolyl endopeptidase
Ligand
BDBM50274983
Substrate
Meas. Tech.
ChEMBL_495212 (CHEMBL998642)
IC50
0.81±n/a nM
Citation
 Kánai, KArányi, PBöcskei, ZFerenczy, GHarmat, VSimon, KBátori, SNáray-Szabo, GHermecz, I Prolyl oligopeptidase inhibition by N-acyl-pro-pyrrolidine-type molecules. J Med Chem 51:7514-22 (2009)  
Target
Name:
Prolyl endopeptidase
Synonyms:
PPCE_RAT | Prep
Type:
PROTEIN
Mol. Mass.:
80731.99
Organism:
Rattus norvegicus
Description:
ChEMBL_1336163
Residue:
710
  
Inhibitor
Name:
BDBM50274983
Synonyms:
2-{3-[(2S)-4,4-Difluoro-2-(pyrrolidinocarbonyl)pyrrolidin-1-yl]-3-oxopropyl}isoindole-1,3(2H)-dione CHEMBL458975
Type:
Small organic molecule
Emp. Form.:
C20H21F2N3O4
Mol. Mass.:
405.3952
SMILES:
FC1(F)C[C@H](N(C1)C(=O)CCN1C(=O)c2ccccc2C1=O)C(=O)N1CCCC1
: