Target
Free fatty acid receptor 4
Ligand
BDBM50240347
Substrate
Meas. Tech.
ChEMBL_495415 (CHEMBL999468)
EC50
2600±n/a nM
Citation
 Suzuki, TIgari, SHirasawa, AHata, MIshiguro, MFujieda, HItoh, YHirano, TNakagawa, HOgura, MMakishima, MTsujimoto, GMiyata, N Identification of G protein-coupled receptor 120-selective agonists derived from PPARgamma agonists. J Med Chem 51:7640-4 (2009)  
Target
Name:
Free fatty acid receptor 4
Synonyms:
FFAR4 G-protein coupled receptor 120 G-protein coupled receptor GT01 GPR120 O3FAR1 PGR4
Type:
PROTEIN
Mol. Mass.:
42256.91
Organism:
Homo sapiens (Human)
Description:
ChEMBL_1508994
Residue:
377
  
Inhibitor
Name:
BDBM50240347
Synonyms:
(9,12,15)-linolenic acid (Z,Z,Z)-9,12,15-octadecatrienoic acid ALA all-cis-9,12,15-octadecatrienoic acid cid_5280934 cis-Delta(9,12,15)-octadecatrienoic acid | linolenic acid
Type:
Small organic molecule
Emp. Form.:
C18H30O2
Mol. Mass.:
278.4296
SMILES:
CC\C=C/C\C=C/C\C=C/CCCCCCCC(O)=O
: