Target
Beta-secretase 2
Ligand
BDBM50254785
Substrate
Meas. Tech.
ChEMBL_560486 (CHEMBL1020506)
IC50
>100000±n/a nM
Citation
 Chirapu, SRPachaiyappan, BNural, HFCheng, XYuan, HLankin, DCAbdul-Hay, SOThatcher, GRShen, YKozikowski, APPetukhov, PA Molecular modeling, synthesis, and activity studies of novel biaryl and fused-ring BACE1 inhibitors. Bioorg Med Chem Lett 19:264-74 (2008)  
Target
Name:
Beta-secretase 2
Synonyms:
AEPLC ASP1 Asp 1 Aspartyl protease 1 BACE2_HUMAN Beta-secretase (BACE) Beta-secretase 2 (BACE-2) Beta-site APP-cleaving enzyme 2 Memapsin-1 beta-Secretase (BACE-2)
Type:
Protein
Mol. Mass.:
56171.20
Organism:
Homo sapiens (Human)
Description:
Q9Y5Z0
Residue:
518
  
Inhibitor
Name:
BDBM50254785
Synonyms:
CHEMBL464918 | N6-((2S,3R)-4-(cyclopropylamino)-3-hydroxy-1-phenylbutan-2-yl)-N8-((R)-1-phenylethyl)-2,3,4,5-tetrahydrobenzo[b]oxepine-6,8-dicarboxamide
Type:
Small organic molecule
Emp. Form.:
C33H39N3O4
Mol. Mass.:
541.6805
SMILES:
C[C@@H](NC(=O)c1cc2OCCCCc2c(c1)C(=O)N[C@@H](Cc1ccccc1)[C@H](O)CNC1CC1)c1ccccc1
: