Target
Cannabinoid receptor 1
Ligand
BDBM50254919
Substrate
Meas. Tech.
ChEMBL_558495 (CHEMBL963901)
IC50
1.91±n/a nM
Citation
 Kim, JYSeo, HJLee, SHJung, MEAhn, KKim, JLee, J Diarylimidazolyl oxadiazole and thiadiazole derivatives as cannabinoid CB1 receptor antagonists. Bioorg Med Chem Lett 19:142-5 (2008)  
Target
Name:
Cannabinoid receptor 1
Synonyms:
Brain-type cannabinoid receptor CB-R CNR1_RAT Cannabinoid receptor Cnr1 | Skr6
Type:
G Protein-Coupled Receptor (GPCR)
Mol. Mass.:
52856.55
Organism:
Rattus norvegicus (rat)
Description:
P20272
Residue:
473
  
Inhibitor
Name:
BDBM50254919
Synonyms:
2-(1-(4-bromophenyl)-2-(2,4-dichlorophenyl)-5-ethyl-1H-imidazol-4-yl)-5-tert-butyl-1,3,4-thiadiazole | CHEMBL520435
Type:
Small organic molecule
Emp. Form.:
C23H21BrCl2N4S
Mol. Mass.:
536.315
SMILES:
CCc1c(nc(-c2ccc(Cl)cc2Cl)n1-c1ccc(Br)cc1)-c1nnc(s1)C(C)(C)C
: