Target
Cannabinoid receptor 1
Ligand
BDBM50255023
Substrate
Meas. Tech.
ChEMBL_558495 (CHEMBL963901)
IC50
8.29±n/a nM
Citation
 Kim, JYSeo, HJLee, SHJung, MEAhn, KKim, JLee, J Diarylimidazolyl oxadiazole and thiadiazole derivatives as cannabinoid CB1 receptor antagonists. Bioorg Med Chem Lett 19:142-5 (2008)  
Target
Name:
Cannabinoid receptor 1
Synonyms:
Brain-type cannabinoid receptor CB-R CNR1_RAT Cannabinoid receptor Cnr1 | Skr6
Type:
G Protein-Coupled Receptor (GPCR)
Mol. Mass.:
52856.55
Organism:
Rattus norvegicus (rat)
Description:
P20272
Residue:
473
  
Inhibitor
Name:
BDBM50255023
Synonyms:
2-(1-(4-bromophenyl)-2-(2,4-dichlorophenyl)-5-ethyl-1H-imidazol-4-yl)-5-(1-phenylcyclopropyl)-1,3,4-thiadiazole | CHEMBL481773
Type:
Small organic molecule
Emp. Form.:
C28H21BrCl2N4S
Mol. Mass.:
596.368
SMILES:
CCc1c(nc(-c2ccc(Cl)cc2Cl)n1-c1ccc(Br)cc1)-c1nnc(s1)C1(CC1)c1ccccc1
: