Target
Prostaglandin E2 receptor EP3 subtype
Ligand
BDBM50254647
Substrate
Meas. Tech.
ChEMBL_558516 (CHEMBL963082)
IC50
3.6±n/a nM
Citation
 Zhou, NZeller, WKrohn, MAnderson, HZhang, JOnua, EKiselyov, ASRamirez, JHalldorsdottir, GAndrésson, TGurney, MESingh, J 3,4-Disubstituted indole acylsulfonamides: a novel series of potent and selective human EP3 receptor antagonists. Bioorg Med Chem Lett 19:123-6 (2008)  
Target
Name:
Prostaglandin E2 receptor EP3 subtype
Synonyms:
PE2R3_HUMAN PGE2-R Prostaglandin E2 receptor Prostaglandin E2 receptor EP3 subtype (EP3) Prostaglandin E2 receptor EP3D subtype (EP3D) | Prostanoid EP3 receptor
Type:
Enzyme
Mol. Mass.:
43335.03
Organism:
Homo sapiens (Human)
Description:
P43115
Residue:
390
  
Inhibitor
Name:
BDBM50254647
Synonyms:
2-(3-(3,4-dichlorophenylsulfonyl)-1H-indol-4-yloxy)-N-(4,5-dichlorothiophen-2-ylsulfonyl)acetamide | CHEMBL480809
Type:
Small organic molecule
Emp. Form.:
C20H12Cl4N2O6S3
Mol. Mass.:
614.326
SMILES:
Clc1cc(sc1Cl)S(=O)(=O)NC(=O)COc1cccc2[nH]cc(c12)S(=O)(=O)c1ccc(Cl)c(Cl)c1
: