Target
Neuronal acetylcholine receptor subunit alpha-3
Ligand
BDBM50254486
Substrate
Meas. Tech.
ChEMBL_558774 (CHEMBL1020767)
Ki
2200±n/a nM
Citation
 Hansen, CPJensen, AABalle, TBitsch-Jensen, KHassan, MMLiljefors, TFrølund, B Carbamoylcholine analogs as nicotinic acetylcholine receptor agonists--structural modifications of 3-(dimethylamino)butyl dimethylcarbamate (DMABC). Bioorg Med Chem Lett 19:87-91 (2008)  
Target
Name:
Neuronal acetylcholine receptor subunit alpha-3
Synonyms:
ACHA3_HUMAN Cholinergic, Nicotinic Alpha3Beta2 Cholinergic, Nicotinic Alpha3Beta4x NACHRA3 Neuronal acetylcholine receptor subunit alpha-3 nicotinic central
Type:
Enzyme Catalytic Domain
Mol. Mass.:
57479.03
Organism:
Homo sapiens (Human)
Description:
Cholinergic, Nicotinic Alpha3Beta2 0 HUMAN::P32297
Residue:
505
  
Inhibitor
Name:
BDBM50254486
Synonyms:
3-(dimethylamino)butyl 2-hydroxyethylcarbamate | CHEMBL501227
Type:
Small organic molecule
Emp. Form.:
C9H20N2O3
Mol. Mass.:
204.2667
SMILES:
CC(CCOC(=O)NCCO)N(C)C
: