Target
Neuronal acetylcholine receptor subunit alpha-3
Ligand
BDBM50254601
Substrate
Meas. Tech.
ChEMBL_558774 (CHEMBL1020767)
Ki
40000±n/a nM
Citation
 Hansen, CPJensen, AABalle, TBitsch-Jensen, KHassan, MMLiljefors, TFrølund, B Carbamoylcholine analogs as nicotinic acetylcholine receptor agonists--structural modifications of 3-(dimethylamino)butyl dimethylcarbamate (DMABC). Bioorg Med Chem Lett 19:87-91 (2008)  
Target
Name:
Neuronal acetylcholine receptor subunit alpha-3
Synonyms:
ACHA3_HUMAN Cholinergic, Nicotinic Alpha3Beta2 Cholinergic, Nicotinic Alpha3Beta4x NACHRA3 Neuronal acetylcholine receptor subunit alpha-3 nicotinic central
Type:
Enzyme Catalytic Domain
Mol. Mass.:
57479.03
Organism:
Homo sapiens (Human)
Description:
Cholinergic, Nicotinic Alpha3Beta2 0 HUMAN::P32297
Residue:
505
  
Inhibitor
Name:
BDBM50254601
Synonyms:
3-cyclopropyl-3-(dimethylamino)propyl dimethylcarbamate | CHEMBL480799
Type:
Small organic molecule
Emp. Form.:
C11H22N2O2
Mol. Mass.:
214.3046
SMILES:
CN(C)C(CCOC(=O)N(C)C)C1CC1
: