Target
Dual specificity protein phosphatase 6
Ligand
BDBM24777
Substrate
Meas. Tech.
ChEMBL_565117 (CHEMBL955131)
IC50
12400±n/a nM
Citation
 Cao, SMurphy, BTFoster, CLazo, JSKingston, DG Bioactivities of simplified adociaquinone B and naphthoquinone derivatives against Cdc25B, MKP-1, and MKP-3 phosphatases. Bioorg Med Chem 17:2276-81 (2009)  
Target
Name:
Dual specificity protein phosphatase 6
Synonyms:
DUS6_RAT MAP kinase phosphatase 3 Mitogen-activated protein kinase phosphatase 3 | Mkp3
Type:
Enzyme
Mol. Mass.:
42303.19
Organism:
Rattus norvegicus
Description:
gi_16758752
Residue:
381
  
Inhibitor
Name:
BDBM24777
Synonyms:
5-hydroxy-1,4-dihydronaphthalene-1,4-dione CHEMBL43612 Juglone (6a)
Type:
Small organic molecule
Emp. Form.:
C10H6O3
Mol. Mass.:
174.1528
SMILES:
Oc1cccc2C(=O)C=CC(=O)c12
: