Target
Dual specificity protein phosphatase 1
Ligand
BDBM24777
Substrate
Meas. Tech.
ChEMBL_565116 (CHEMBL965760)
IC50
13000±n/a nM
Citation
 Cao, SMurphy, BTFoster, CLazo, JSKingston, DG Bioactivities of simplified adociaquinone B and naphthoquinone derivatives against Cdc25B, MKP-1, and MKP-3 phosphatases. Bioorg Med Chem 17:2276-81 (2009)  
Target
Name:
Dual specificity protein phosphatase 1
Synonyms:
3ch134 Dusp1 Ptpn10 | Ptpn16
Type:
PROTEIN
Mol. Mass.:
39372.46
Organism:
Mus musculus
Description:
ChEMBL_565116
Residue:
367
  
Inhibitor
Name:
BDBM24777
Synonyms:
5-hydroxy-1,4-dihydronaphthalene-1,4-dione CHEMBL43612 Juglone (6a)
Type:
Small organic molecule
Emp. Form.:
C10H6O3
Mol. Mass.:
174.1528
SMILES:
Oc1cccc2C(=O)C=CC(=O)c12
: