Target
Dual specificity protein phosphatase 1
Ligand
BDBM24778
Substrate
Meas. Tech.
ChEMBL_565116 (CHEMBL965760)
IC50
24000±n/a nM
Citation
 Cao, SMurphy, BTFoster, CLazo, JSKingston, DG Bioactivities of simplified adociaquinone B and naphthoquinone derivatives against Cdc25B, MKP-1, and MKP-3 phosphatases. Bioorg Med Chem 17:2276-81 (2009)  
Target
Name:
Dual specificity protein phosphatase 1
Synonyms:
3ch134 Dusp1 Ptpn10 | Ptpn16
Type:
PROTEIN
Mol. Mass.:
39372.46
Organism:
Mus musculus
Description:
ChEMBL_565116
Residue:
367
  
Inhibitor
Name:
BDBM24778
Synonyms:
2-methyl-1,4-dihydronaphthalene-1,4-dione CHEMBL590 Menadione (5d) Menadione, 9 cid_4055
Type:
Small organic molecule
Emp. Form.:
C11H8O2
Mol. Mass.:
172.18
SMILES:
CC1=CC(=O)c2ccccc2C1=O
: