Target
Ephrin type-A receptor 3
Ligand
BDBM26145
Substrate
Meas. Tech.
ChEMBL_537100 (CHEMBL988932)
Kd
0.100000±n/a nM
Citation
 Bamborough, PDrewry, DHarper, GSmith, GKSchneider, K Assessment of chemical coverage of kinome space and its implications for kinase drug discovery. J Med Chem 51:7898-914 (2008)  
Target
Name:
Ephrin type-A receptor 3
Synonyms:
EPHA3 ETK Ephrin receptor Ephrin type-A receptor 3 (EPHA3) TYRO4
Type:
Protein
Mol. Mass.:
110131.95
Organism:
Homo sapiens (Human)
Description:
P29320
Residue:
983
  
Inhibitor
Name:
BDBM26145
Synonyms:
2,4-dianilino pyrimidine, 2 CHEMBL249097
Type:
Small organic molecule
Emp. Form.:
C18H17N5O2
Mol. Mass.:
335.3599
SMILES:
Cc1ccc(O)cc1Nc1ccnc(Nc2cccc(c2)C(N)=O)n1
: