Target
Suppressor of tumorigenicity 14 protein
Ligand
BDBM50254219
Substrate
Meas. Tech.
ChEMBL_559006 (CHEMBL1010203)
Ki
3±n/a nM
Citation
 Steinmetzer, TDönnecke, DKorsonewski, MNeuwirth, CSteinmetzer, PSchulze, ASaupe, SMSchweinitz, A Modification of the N-terminal sulfonyl residue in 3-amidinophenylalanine-based matriptase inhibitors. Bioorg Med Chem Lett 19:67-73 (2008)  
Target
Name:
Suppressor of tumorigenicity 14 protein
Synonyms:
Epithin MT-SP1 PRSS14 SNC19 ST14_HUMAN Suppressor of tumorigenicity 14 protein TADG15
Type:
Single-pass type II membrane protein
Mol. Mass.:
94769.23
Organism:
Homo sapiens (Human)
Description:
Q9Y5Y6
Residue:
855
  
Inhibitor
Name:
BDBM50254219
Synonyms:
Azetidine-3-carboxylic acid {3-[(S)-2-[4-(2-amino-ethyl)-piperidin-1-yl]-1-(3-carbamimidoyl-benzyl)-2-oxo-ethylsulfamoyl]-phenyl}-amide US8569313, 71
Type:
Small organic molecule
Emp. Form.:
C27H37N7O4S
Mol. Mass.:
555.692
SMILES:
NCCC1CCN(CC1)C(=O)[C@H](Cc1cccc(c1)C(N)=N)NS(=O)(=O)c1cccc(NC(=O)C2CNC2)c1
: