Target
Caspase-1
Ligand
BDBM50200305
Substrate
Meas. Tech.
ChEMBL_537867 (CHEMBL990679)
EC50
>5000±n/a nM
Citation
 Smith, GGlaser, MPerumal, MNguyen, QDShan, BArstad, EAboagye, EO Design, synthesis, and biological characterization of a caspase 3/7 selective isatin labeled with 2-[18F]fluoroethylazide. J Med Chem 51:8057-67 (2008)  
Target
Name:
Caspase-1
Synonyms:
CASP1 Caspase ICE IL1BCE Interleukin-1 beta-converting enzyme
Type:
Enzyme
Mol. Mass.:
45154.13
Organism:
Homo sapiens (Human)
Description:
P29466
Residue:
404
  
Inhibitor
Name:
BDBM50200305
Synonyms:
(S)-1-(4-iodobenzyl)-5-(2-phenoxymethyl-pyrrolidine-1-sulfonyl)isatin CHEMBL384023
Type:
Small organic molecule
Emp. Form.:
C26H23IN2O5S
Mol. Mass.:
602.441
SMILES:
Ic1ccc(CN2C(=O)C(=O)c3cc(ccc23)S(=O)(=O)N2CCC[C@H]2COc2ccccc2)cc1
: