Target
Caspase-6
Ligand
BDBM50273928
Substrate
Meas. Tech.
ChEMBL_537868 (CHEMBL990680)
EC50
>5000±n/a nM
Citation
 Smith, GGlaser, MPerumal, MNguyen, QDShan, BArstad, EAboagye, EO Design, synthesis, and biological characterization of a caspase 3/7 selective isatin labeled with 2-[18F]fluoroethylazide. J Med Chem 51:8057-67 (2008)  
Target
Name:
Caspase-6
Synonyms:
Apoptotic protease Mch-2 CASP6 Caspase | MCH2
Type:
Enzyme
Mol. Mass.:
33312.62
Organism:
Homo sapiens (Human)
Description:
P55212
Residue:
293
  
Inhibitor
Name:
BDBM50273928
Synonyms:
(S)-1-(4-Fluorobenzyl)-5-(2-(3-fluorophenoxymethyl)-pyrrolidine-1-sulfonyl)isatin | CHEMBL461249
Type:
Small organic molecule
Emp. Form.:
C26H22F2N2O5S
Mol. Mass.:
512.525
SMILES:
Fc1ccc(CN2C(=O)C(=O)c3cc(ccc23)S(=O)(=O)N2CCC[C@H]2COc2cccc(F)c2)cc1
: