Target
Caspase-8
Ligand
BDBM50273339
Substrate
Meas. Tech.
ChEMBL_537869 (CHEMBL990681)
EC50
>5000±n/a nM
Citation
 Smith, GGlaser, MPerumal, MNguyen, QDShan, BArstad, EAboagye, EO Design, synthesis, and biological characterization of a caspase 3/7 selective isatin labeled with 2-[18F]fluoroethylazide. J Med Chem 51:8057-67 (2008)  
Target
Name:
Caspase-8
Synonyms:
Apoptotic cysteine protease CAP4 CASP8 Caspase Caspase-8 subunit p18 FADD-like ICE ICE-like apoptotic protease 5 MCH5 | MORT1-associated CED-3 homolog
Type:
Enzyme
Mol. Mass.:
55373.89
Organism:
Homo sapiens (Human)
Description:
Q14790
Residue:
479
  
Inhibitor
Name:
BDBM50273339
Synonyms:
(S)-1-(4-Fluorobenzyl)-5-(2-((1-(2-fluoroethyl)-1H-[1,2,3]-triazol-4-yl)methoxymethyl)-pyrrolidine-1-sulfonyl)isatin | CHEMBL518382
Type:
Small organic molecule
Emp. Form.:
C25H25F2N5O5S
Mol. Mass.:
545.558
SMILES:
FCCn1cc(COC[C@@H]2CCCN2S(=O)(=O)c2ccc3N(Cc4ccc(F)cc4)C(=O)C(=O)c3c2)nn1
: