Target
11-beta-hydroxysteroid dehydrogenase 1
Ligand
BDBM13754
Substrate
Meas. Tech.
ChEMBL_561232 (CHEMBL1012778)
Ki
22±n/a nM
Citation
 Fotsch, CBartberger, MDBercot, EAChen, MCupples, REmery, MFretland, JGuram, AHale, CHan, NHickman, DHungate, RWHayashi, MKomorowski, RLiu, QMatsumoto, GSt Jean, DJUrsu, SVéniant, MXu, GYe, QYuan, CZhang, JZhang, XTu, HWang, M Further studies with the 2-amino-1,3-thiazol-4(5H)-one class of 11beta-hydroxysteroid dehydrogenase type 1 inhibitors: reducing pregnane X receptor activity and exploring activity in a monkey pharmacodynamic model. J Med Chem 51:7953-67 (2008)  
Target
Name:
11-beta-hydroxysteroid dehydrogenase 1
Synonyms:
11-DH 11-beta-Hydroxysteroid Dehydrogenase 1 (11-beta-HSD1) 11-beta-hydroxysteroid dehydrogenase 1 (11HSD1) Corticosteroid 11-beta-dehydrogenase isozyme 1 (11-beta-HSD-1) Corticosteroid 11-beta-dehydrogenase isozyme 1 (11beta-HSD1) HSD11 HSD11L | SDR26C1
Type:
Enzyme
Mol. Mass.:
32409.16
Organism:
Homo sapiens (Human)
Description:
P28845
Residue:
292
  
Inhibitor
Name:
BDBM13754
Synonyms:
(5S)-2-{[(1S)-1-(2-fluorophenyl)ethyl]amino}-5-methyl-5-(trifluoromethyl)-4,5-dihydro-1,3-thiazol-4-one 2-(S)-Phenethylamine analog 17 | CHEMBL218006
Type:
Small organic molecule
Emp. Form.:
C13H12F4N2OS
Mol. Mass.:
320.306
SMILES:
C[C@H](NC1=NC(=O)[C@](C)(S1)C(F)(F)F)c1ccccc1F
: