Target
Mu-type opioid receptor
Ligand
BDBM50273415
Substrate
Meas. Tech.
ChEMBL_561947 (CHEMBL1021465)
Ki
>2930±n/a nM
Citation
 Kurimura, MLiu, HSulima, AHashimoto, APrzybyl, AKOhshima, EKodato, SDeschamps, JRDersch, CMRothman, RBLee, YSJacobson, AERice, KC Probes for narcotic receptor mediated phenomena. 37. Synthesis and opioid binding affinity of the final pair of oxide-bridged phenylmorphans, the ortho- and para-b-isomers and their N-phenethyl analogues, and the synthesis of the N-phenethyl analogues of the ortho- and para-d-isomers. J Med Chem 51:7866-81 (2008)  
Target
Name:
Mu-type opioid receptor
Synonyms:
M-OR-1 MOR-1 MUOR1 Mu opiate receptor OPRM1 hMOP | mu-type opioid receptor isoform MOR-1
Type:
G Protein-Coupled Receptor (GPCR)
Mol. Mass.:
44789.51
Organism:
Homo sapiens (Human)
Description:
P35372
Residue:
400
  
Inhibitor
Name:
BDBM50273415
Synonyms:
(3R*,6aS*,11aR*)-1,3,4,5,6,11a-Hexahydro-2-methyl-2H-3,6a-methanobenzofuro[2,3-c]azocin-8-ol | CHEMBL509260
Type:
Small organic molecule
Emp. Form.:
C15H19NO2
Mol. Mass.:
245.3169
SMILES:
CN1C[C@@H]2Oc3ccc(O)cc3[C@@]22CCC[C@@H]1C2
: