Target
C-X-C chemokine receptor type 4
Ligand
BDBM50247129
Substrate
Meas. Tech.
ChEMBL_556955 (CHEMBL958141)
IC50
2.1±n/a nM
Citation
 Thoma, GStreiff, MBKovarik, JGlickman, FWagner, TBeerli, CZerwes, HG Orally bioavailable isothioureas block function of the chemokine receptor CXCR4 in vitro and in vivo. J Med Chem 51:7915-20 (2008)  
Target
Name:
C-X-C chemokine receptor type 4
Synonyms:
C-X-C chemokine receptor type 4 CD_antigen=CD184 CXCR-4 CXCR4_HUMAN Fusin LCR1 Leukocyte-derived seven transmembrane domain receptor SDF-1 receptor | Stromal cell-derived factor 1 receptor
Type:
Enzyme
Mol. Mass.:
39754.61
Organism:
Homo sapiens (Human)
Description:
P61073
Residue:
352
  
Inhibitor
Name:
BDBM50247129
Synonyms:
1,3-dicycloheptyl-2-((6,6-dimethyl-5,6-dihydroimidazo[2,1-b]thiazol-3-yl)methyl)isothiourea | CHEMBL518501
Type:
Small organic molecule
Emp. Form.:
C23H38N4S2
Mol. Mass.:
434.705
SMILES:
CC1(C)CN2C(CS\C(NC3CCCCCC3)=N/C3CCCCCC3)=CSC2=N1
: