Target
Glutamate carboxypeptidase 2
Ligand
BDBM50246935
Substrate
Meas. Tech.
ChEMBL_557375 (CHEMBL955705)
Ki
0.557±n/a nM
Citation
 Chen, YFoss, CAByun, YNimmagadda, SPullambhatla, MFox, JJCastanares, MLupold, SEBabich, JWMease, RCPomper, MG Radiohalogenated prostate-specific membrane antigen (PSMA)-based ureas as imaging agents for prostate cancer. J Med Chem 51:7933-43 (2008)  
Target
Name:
Glutamate carboxypeptidase 2
Synonyms:
FGCP FOLH1 Folate hydrolase 1 Glutamate carboxypeptidase 2 Membrane glutamate carboxypeptidase NAALAD1 PSM Prostate-specific membrane antigen mGCP
Type:
PROTEIN
Mol. Mass.:
84333.66
Organism:
Homo sapiens (Human)
Description:
ChEMBL_1497035
Residue:
750
  
Inhibitor
Name:
BDBM50246935
Synonyms:
(S)-2-(3-((S)-1-carboxy-5-(3-iodonicotinamido)pentyl)ureido)pentanedioic acid | CHEMBL454898
Type:
Small organic molecule
Emp. Form.:
C18H23IN4O8
Mol. Mass.:
550.3017
SMILES:
OC(=O)CC[C@H](NC(=O)N[C@@H](CCCCNC(=O)c1cncc(I)c1)C(O)=O)C(O)=O
: