Target
Lipoprotein lipase
Ligand
BDBM50254434
Substrate
Meas. Tech.
ChEMBL_559993 (CHEMBL1018743)
IC50
50±n/a nM
Citation
 Goodman, KBBury, MJCheung, MCichy-Knight, MADowdell, SEDunn, AKLee, DLieby, JAMoore, MLScherzer, DASha, DSuarez, DPMurphy, DJHarpel, MRManas, ESMcNulty, DEAnnan, RSMatico, RESchwartz, BKTrill, JJSweitzer, TDWang, DYKeller, PMKrawiec, JAJaye, MC Discovery of potent, selective sulfonylfuran urea endothelial lipase inhibitors. Bioorg Med Chem Lett 19:27-30 (2008)  
Target
Name:
Lipoprotein lipase
Synonyms:
LIPL_RAT | Lpl
Type:
PROTEIN
Mol. Mass.:
53093.31
Organism:
Rattus norvegicus
Description:
ChEMBL_559993
Residue:
474
  
Inhibitor
Name:
BDBM50254434
Synonyms:
5-Methyl-4-(3-phenyl-ureido)-furan-2-sulfonic acid (2-methoxy-ethyl)-methyl-amide | CHEMBL468281
Type:
Small organic molecule
Emp. Form.:
C16H21N3O5S
Mol. Mass.:
367.42
SMILES:
COCCN(C)S(=O)(=O)c1cc(NC(=O)Nc2ccccc2)c(C)o1
: