Target
Hepatocyte growth factor receptor
Ligand
BDBM50265923
Substrate
Meas. Tech.
ChEMBL_540197 (CHEMBL1029826)
IC50
170±n/a nM
Citation
 Porter, JLumb, SLecomte, FReuberson, JFoley, ACalmiano, Mle Riche, KEdwards, HDelgado, JFranklin, RJGascon-Simorte, JMMaloney, AMeier, CBatchelor, M Discovery of a novel series of quinoxalines as inhibitors of c-Met kinase. Bioorg Med Chem Lett 19:397-400 (2008)  
Target
Name:
Hepatocyte growth factor receptor
Synonyms:
Hepatocyte growth factor receptor Hepatocyte growth factor receptor (c-MET) MET Met proto-oncogene (hepatocyte growth factor receptor) Tyrosine-protein kinase Met (c-Met) c-Met kinase
Type:
Protein
Mol. Mass.:
155559.73
Organism:
Homo sapiens (Human)
Description:
P08581
Residue:
1390
  
Inhibitor
Name:
BDBM50265923
Synonyms:
5-(3-(4-methylpiperazin-1-yl)-7-(trifluoromethyl)quinoxalin-5-yl)indolin-2-one | CHEMBL468787
Type:
Small organic molecule
Emp. Form.:
C22H20F3N5O
Mol. Mass.:
427.4223
SMILES:
CN1CCN(CC1)c1cnc2cc(cc(-c3ccc4NC(=O)Cc4c3)c2n1)C(F)(F)F
: