Target
Secreted frizzled-related protein 1
Ligand
BDBM50265480
Substrate
Meas. Tech.
ChEMBL_560813 (CHEMBL1011781)
IC50
100±n/a nM
Citation
 Moore, WJKern, JCBhat, RCommons, TJFukayama, SGoljer, IKrishnamurthy, GMagolda, RLNogle, LPitts, KStauffer, BTrybulski, EJWelmaker, GSWilson, MBodine, PV Modulation of Wnt signaling through inhibition of secreted frizzled-related protein I (sFRP-1) with N-substituted piperidinyl diphenylsulfonyl sulfonamides. J Med Chem 52:105-16 (2009)  
Target
Name:
Secreted frizzled-related protein 1
Synonyms:
FRP SARP2 SFRP1_HUMAN
Type:
PROTEIN
Mol. Mass.:
35404.91
Organism:
Homo sapiens (Human)
Description:
ChEMBL_1363191
Residue:
314
  
Inhibitor
Name:
BDBM50265480
Synonyms:
CHEMBL523726 | N-[1-(Morpholin-4-ylacetyl)piperidin-4-yl]-5-(phenylsulfonyl)-2-(trifluoromethyl)benzenesulfonamide
Type:
Small organic molecule
Emp. Form.:
C24H28F3N3O6S2
Mol. Mass.:
575.621
SMILES:
FC(F)(F)c1ccc(cc1S(=O)(=O)NC1CCN(CC1)C(=O)CN1CCOCC1)S(=O)(=O)c1ccccc1
: