Target
Thermolysin
Ligand
BDBM50292712
Substrate
Meas. Tech.
ChEMBL_494286 (CHEMBL938618)
IC50
0.064±n/a nM
Citation
 Khan, MTFuskevåg, OMSylte, I Discovery of potent thermolysin inhibitors using structure based virtual screening and binding assays. J Med Chem 52:48-61 (2009)  
Target
Name:
Thermolysin
Synonyms:
THER_BACTH | npr
Type:
PROTEIN
Mol. Mass.:
60097.54
Organism:
Bacillus thermoproteolyticus
Description:
ChEMBL_1468794
Residue:
548
  
Inhibitor
Name:
BDBM50292712
Synonyms:
1beta-D-arabinofuranosyl-N4-lauroylcytosine | CHEMBL459183
Type:
Small organic molecule
Emp. Form.:
C21H35N3O6
Mol. Mass.:
425.5191
SMILES:
CCCCCCCCCCCC(=O)Nc1ccn([C@@H]2O[C@H](CO)[C@@H](O)[C@@H]2O)c(=O)n1
: