Target
Beta-3 adrenergic receptor
Ligand
BDBM50274875
Substrate
Meas. Tech.
ChEMBL_494295 (CHEMBL938627)
IC50
590±n/a nM
Citation
 Shakya, NRoy, KKSaxena, AK Substituted 1,2,3,4-tetrahydroquinolin-6-yloxypropanes as beta3-adrenergic receptor agonists: design, synthesis, biological evaluation and pharmacophore modeling. Bioorg Med Chem 17:830-47 (2009)  
Target
Name:
Beta-3 adrenergic receptor
Synonyms:
ADRB3 ADRB3_HUMAN Beta-2 adrenergic receptor and beta-3 adrenergic receptor Beta-3 adrenoreceptor | adrenergic Beta3
Type:
G Protein-Coupled Receptor (GPCR)
Mol. Mass.:
43534.88
Organism:
Homo sapiens (Human)
Description:
Residue:
408
  
Inhibitor
Name:
BDBM50274875
Synonyms:
1-(1-Benzyl-1,2,3,4-tetrahydroquinolin-6-yloxy)-3-isopropylaminopropan-2-ol | CHEMBL458541
Type:
Small organic molecule
Emp. Form.:
C22H30N2O2
Mol. Mass.:
354.4858
SMILES:
CC(C)NCC(O)COc1ccc2N(Cc3ccccc3)CCCc2c1
: