Target
Sphingosine 1-phosphate receptor 5
Ligand
BDBM50277187
Substrate
Meas. Tech.
ChEMBL_540421 (CHEMBL1029038)
IC50
1.1±n/a nM
Citation
 Evindar, GBernier, SGKavarana, MJDoyle, ELorusso, JKelley, MSHalley, KHutchings, AWright, ADSaha, AKHannig, GMorgan, BAWestlin, WF Synthesis and evaluation of alkoxy-phenylamides and alkoxy-phenylimidazoles as potent sphingosine-1-phosphate receptor subtype-1 agonists. Bioorg Med Chem Lett 19:369-72 (2008)  
Target
Name:
Sphingosine 1-phosphate receptor 5
Synonyms:
EDG8 S1P5 S1PR5_HUMAN Sphingosine 1-phosphate receptor Edg-8
Type:
G Protein-Coupled Receptor (GPCR)
Mol. Mass.:
41796.42
Organism:
Homo sapiens (Human)
Description:
Residue:
398
  
Inhibitor
Name:
BDBM50277187
Synonyms:
(R)-2-amino-2-(4-(3-fluoro-4-(octyloxy)phenyl)-1H-imidazol-2-yl)propyl dihydrogen phosphate | CHEMBL473269
Type:
Small organic molecule
Emp. Form.:
C20H31FN3O5P
Mol. Mass.:
443.4494
SMILES:
CCCCCCCCOc1ccc(cc1F)-c1c[nH]c(n1)[C@@](C)(N)COP(O)(O)=O
: