Target
Histone deacetylase 1
Ligand
BDBM50277188
Substrate
Meas. Tech.
ChEMBL_540427 (CHEMBL1029044)
IC50
9±n/a nM
Citation
 Wahhab, ASmil, DAjamian, AAllan, MChantigny, YTherrien, ENguyen, NManku, SLeit, SRahil, JPetschner, AJLu, AHNicolescu, ALefebvre, SMontcalm, SFournel, MYan, TPLi, ZBesterman, JMDéziel, R Sulfamides as novel histone deacetylase inhibitors. Bioorg Med Chem Lett 19:336-40 (2008)  
Target
Name:
Histone deacetylase 1
Synonyms:
Cereblon/Histone deacetylase 1 HDAC1 Histone deacetylase 1 (HDAC1) RPD3L1
Type:
Enzyme
Mol. Mass.:
55090.27
Organism:
Homo sapiens (Human)
Description:
Q13547
Residue:
482
  
Inhibitor
Name:
BDBM50277188
Synonyms:
CHEMBL473270 | N1-(biphenyl-3-yl)-N8-hydroxyoctanediamide
Type:
Small organic molecule
Emp. Form.:
C20H24N2O3
Mol. Mass.:
340.4162
SMILES:
ONC(=O)CCCCCCC(=O)Nc1cccc(c1)-c1ccccc1
: