Target
Histone deacetylase 6
Ligand
BDBM19149
Substrate
Meas. Tech.
ChEMBL_540428 (CHEMBL1029045)
IC50
200±n/a nM
Citation
 Wahhab, ASmil, DAjamian, AAllan, MChantigny, YTherrien, ENguyen, NManku, SLeit, SRahil, JPetschner, AJLu, AHNicolescu, ALefebvre, SMontcalm, SFournel, MYan, TPLi, ZBesterman, JMDéziel, R Sulfamides as novel histone deacetylase inhibitors. Bioorg Med Chem Lett 19:336-40 (2008)  
Target
Name:
Histone deacetylase 6
Synonyms:
Cereblon/Histone deacetylase 6 HDAC6 Histone deacetylase 6 (HDAC6) KIAA0901 | ORF Names:JM21
Type:
Chromatin regulator; hydrolase; repressor
Mol. Mass.:
131381.51
Organism:
Homo sapiens (Human)
Description:
Q9UBN7
Residue:
1215
  
Inhibitor
Name:
BDBM19149
Synonyms:
CHEMBL98 SAHA US10188756, Compound SAHA US11505523, Compound SAHA US9353061, SAHA US9695181, Vorinostat Zolinza suberoylanilide hydroxamic acid
Type:
Small organic molecule
Emp. Form.:
C14H20N2O3
Mol. Mass.:
264.3202
SMILES:
ONC(=O)CCCCCCC(=O)Nc1ccccc1
: