Target
Cannabinoid receptor 1
Ligand
BDBM50277195
Substrate
Meas. Tech.
ChEMBL_540511 (CHEMBL1030615)
Ki
260±n/a nM
Citation
 Goodman, AJAjello, CWWorm, KLe Bourdonnec, BSavolainen, MAO'Hare, HCassel, JAStabley, GJDehaven, RNLabuda, CJKoblish, MLittle, PJBrogdon, BLSmith, SADolle, RE CB2 selective sulfamoyl benzamides: optimization of the amide functionality. Bioorg Med Chem Lett 19:309-13 (2008)  
Target
Name:
Cannabinoid receptor 1
Synonyms:
CANN6 CB-R CNR CNR1_HUMAN Cannabinoid receptor Cannabinoid receptor 1 (brain)
Type:
G Protein-Coupled Receptor (GPCR)
Mol. Mass.:
52868.96
Organism:
Homo sapiens (Human)
Description:
P21554
Residue:
472
  
Inhibitor
Name:
BDBM50277195
Synonyms:
4-(5-(4-tert-butylthiazol-2-yl)-2-methylphenylsulfonyl)morpholine | CHEMBL475093
Type:
Small organic molecule
Emp. Form.:
C18H24N2O3S2
Mol. Mass.:
380.525
SMILES:
Cc1ccc(cc1S(=O)(=O)N1CCOCC1)-c1nc(cs1)C(C)(C)C
: