Target
Cannabinoid receptor 1
Ligand
BDBM50256074
Substrate
Meas. Tech.
ChEMBL_515074 (CHEMBL1034816)
IC50
1173.2±n/a nM
Citation
 Hou, DRAlam, SKuan, TCRamanathan, MLin, TPHung, MS 1,2,3-Triazole derivatives as new cannabinoid CB1 receptor antagonists. Bioorg Med Chem Lett 19:1022-5 (2009)  
Target
Name:
Cannabinoid receptor 1
Synonyms:
CANN6 CB-R CNR CNR1_HUMAN Cannabinoid receptor Cannabinoid receptor 1 (brain)
Type:
G Protein-Coupled Receptor (GPCR)
Mol. Mass.:
52868.96
Organism:
Homo sapiens (Human)
Description:
P21554
Residue:
472
  
Inhibitor
Name:
BDBM50256074
Synonyms:
CHEMBL481885 | butyl 2-(4,5-bis(2,4-dichlorophenyl)-2H-1,2,3-triazol-2-yl)acetate
Type:
Small organic molecule
Emp. Form.:
C20H17Cl4N3O2
Mol. Mass.:
473.18
SMILES:
CCCCOC(=O)Cn1nc(c(n1)-c1ccc(Cl)cc1Cl)-c1ccc(Cl)cc1Cl
: