Target
Cannabinoid receptor 1
Ligand
BDBM50256121
Substrate
Meas. Tech.
ChEMBL_515076 (CHEMBL1034818)
EC50
203.6±n/a nM
Citation
 Hou, DRAlam, SKuan, TCRamanathan, MLin, TPHung, MS 1,2,3-Triazole derivatives as new cannabinoid CB1 receptor antagonists. Bioorg Med Chem Lett 19:1022-5 (2009)  
Target
Name:
Cannabinoid receptor 1
Synonyms:
CANN6 CB-R CNR CNR1_HUMAN Cannabinoid receptor Cannabinoid receptor 1 (brain)
Type:
G Protein-Coupled Receptor (GPCR)
Mol. Mass.:
52868.96
Organism:
Homo sapiens (Human)
Description:
P21554
Residue:
472
  
Inhibitor
Name:
BDBM50256121
Synonyms:
2-(4,5-bis(2,4-dichlorophenyl)-2H-1,2,3-triazol-2-yl)-N-cyclohexylacetamide | CHEMBL474601
Type:
Small organic molecule
Emp. Form.:
C22H20Cl4N4O
Mol. Mass.:
498.232
SMILES:
Clc1ccc(-c2nn(CC(=O)NC3CCCCC3)nc2-c2ccc(Cl)cc2Cl)c(Cl)c1
: