Target
Cannabinoid receptor 2
Ligand
BDBM50256170
Substrate
Meas. Tech.
ChEMBL_515077 (CHEMBL1034819)
IC50
>10±n/a nM
Citation
 Hou, DRAlam, SKuan, TCRamanathan, MLin, TPHung, MS 1,2,3-Triazole derivatives as new cannabinoid CB1 receptor antagonists. Bioorg Med Chem Lett 19:1022-5 (2009)  
Target
Name:
Cannabinoid receptor 2
Synonyms:
CANNABINOID CB2 CB2 CB2B CNR2_HUMAN Cannabinoid CB2 receptor Cannabinoid receptor 2 (CB2R) | hCB2
Type:
G Protein-Coupled Receptor (GPCR)
Mol. Mass.:
39690.94
Organism:
Homo sapiens (Human)
Description:
P34972
Residue:
360
  
Inhibitor
Name:
BDBM50256170
Synonyms:
2-(4-(4-chlorophenyl)-5-(2,4-dichlorophenyl)-2H-1,2,3-triazol-2-yl)-N-(2-fluorobenzyl)acetamide | CHEMBL482308
Type:
Small organic molecule
Emp. Form.:
C23H16Cl3FN4O
Mol. Mass.:
489.757
SMILES:
Fc1ccccc1CNC(=O)Cn1nc(c(n1)-c1ccc(Cl)cc1Cl)-c1ccc(Cl)cc1
: