Target
Solute carrier family 28 member 3
Ligand
BDBM50256748
Substrate
Meas. Tech.
ChEMBL_518727 (CHEMBL957102)
Ki
>100000±n/a nM
Citation
 Gupte, ABuolamwini, JK Synthesis and biological evaluation of phloridzin analogs as human concentrative nucleoside transporter 3 (hCNT3) inhibitors. Bioorg Med Chem Lett 19:917-21 (2009)  
Target
Name:
Solute carrier family 28 member 3
Synonyms:
CNT3 SLC28A3
Type:
PROTEIN
Mol. Mass.:
76938.51
Organism:
Homo sapiens (Human)
Description:
ChEMBL_1494517
Residue:
691
  
Inhibitor
Name:
BDBM50256748
Synonyms:
1-(2,6-dihydroxy-4-((2S,3R,4S,5S,6R)-3,4,5-trihydroxy-6-(hydroxymethyl)tetrahydro-2H-pyran-2-yloxy)phenyl)-3-(4-hydroxyphenyl)propan-1-one | CHEMBL514177
Type:
Small organic molecule
Emp. Form.:
C21H24O10
Mol. Mass.:
436.4093
SMILES:
OC[C@H]1O[C@@H](Oc2cc(O)c(C(=O)CCc3ccc(O)cc3)c(O)c2)[C@H](O)[C@@H](O)[C@@H]1O
: