Target
Sodium/nucleoside cotransporter 1
Ligand
BDBM20875
Substrate
Meas. Tech.
ChEMBL_518725 (CHEMBL940635)
IC50
250000±n/a nM
Citation
 Gupte, ABuolamwini, JK Synthesis and biological evaluation of phloridzin analogs as human concentrative nucleoside transporter 3 (hCNT3) inhibitors. Bioorg Med Chem Lett 19:917-21 (2009)  
Target
Name:
Sodium/nucleoside cotransporter 1
Synonyms:
CNT1 SLC28A1
Type:
PROTEIN
Mol. Mass.:
71589.29
Organism:
Homo sapiens (Human)
Description:
ChEMBL_1494515
Residue:
649
  
Inhibitor
Name:
BDBM20875
Synonyms:
1-(2,4-dihydroxy-6-{[(2S,3R,4S,5S,6R)-3,4,5-trihydroxy-6-(hydroxymethyl)oxan-2-yl]oxy}phenyl)-3-(4-hydroxyphenyl)propan-1-one CHEMBL245067 O-glucoside, 1 | Phlorizin
Type:
Natural product
Emp. Form.:
C21H24O10
Mol. Mass.:
436.4093
SMILES:
OC[C@H]1O[C@@H](Oc2cc(O)cc(O)c2C(=O)CCc2ccc(O)cc2)[C@H](O)[C@@H](O)[C@@H]1O
: