Target
Receptor tyrosine-protein kinase erbB-4
Ligand
BDBM50256478
Substrate
Meas. Tech.
ChEMBL_519644 (CHEMBL946771)
IC50
74±n/a nM
Citation
 Emmitte, KAWilson, BJBaum, EWEmerson, HKKuntz, KWNailor, KESalovich, JMSmith, SCCheung, MGerding, RMStevens, KLUehling, DEMook, RAMoorthy, GSDickerson, SHHassell, AMLeesnitzer, MAShewchuk, LMGroy, ARowand, JLAnderson, KAtkins, CLYang, JSabbatini, PKumar, R Discovery and optimization of imidazo[1,2-a]pyridine inhibitors of insulin-like growth factor-1 receptor (IGF-1R). Bioorg Med Chem Lett 19:1004-8 (2009)  
Target
Name:
Receptor tyrosine-protein kinase erbB-4
Synonyms:
ERBB4 Epidermal growth factor receptor ErbB-4 (HER4) Tyrosine Kinase Proto-oncogene c-ErbB-4 Receptor protein-tyrosine kinase erbB-4 Tyrosine kinase-type cell surface receptor HER4 (HER4)
Type:
Protein
Mol. Mass.:
146803.56
Organism:
Homo sapiens (Human)
Description:
Q15303
Residue:
1308
  
Inhibitor
Name:
BDBM50256478
Synonyms:
CHEMBL507714 | N-(2,6-difluorophenyl)-3-(3-(2-(2-methoxy-4-(4-(4-(methylsulfonyl)piperazin-1-yl)piperidin-1-yl)phenylamino)pyrimidin-4-yl)imidazo[1,2-a]pyridin-2-yl)benzamide
Type:
Small organic molecule
Emp. Form.:
C41H41F2N9O4S
Mol. Mass.:
793.884
SMILES:
COc1cc(ccc1Nc1nccc(n1)-c1c(nc2ccccn12)-c1cccc(c1)C(=O)Nc1c(F)cccc1F)N1CCC(CC1)N1CCN(CC1)S(C)(=O)=O
: