Target
Prostaglandin F2-alpha receptor
Ligand
BDBM50247915
Substrate
Meas. Tech.
ChEMBL_495706 (CHEMBL1006985)
Ki
120±n/a nM
Citation
 Feng, ZHellberg, MRSharif, NAMcLaughlin, MAWilliams, GWScott, DWallace, T Discovery of 13-oxa prostaglandin analogs as antiglaucoma agents: synthesis and biological activity. Bioorg Med Chem 17:576-84 (2009)  
Target
Name:
Prostaglandin F2-alpha receptor
Synonyms:
PF2R_BOVIN PGF2 alpha receptor ProstaglandinF2Alpha | Prostanoid FP receptor
Type:
Enzyme Catalytic Domain
Mol. Mass.:
41044.75
Organism:
BOVINE
Description:
ProstaglandinF2Alpha PTGFR BOVINE::P37289
Residue:
362
  
Inhibitor
Name:
BDBM50247915
Synonyms:
5Z-(9S,11R,15R)-13-Oxa-16-phenoxy-propoxy]-9,11,15-trihydroxy-17,18,19,20-tetranor-5-prostadienoic acid | CHEMBL523143
Type:
Small organic molecule
Emp. Form.:
C21H30O7
Mol. Mass.:
394.4587
SMILES:
O[C@H](CO[C@H]1[C@H](O)C[C@H](O)[C@@H]1C\C=C/CCCC(O)=O)COc1ccccc1
: