Target
Macrophage colony-stimulating factor 1 receptor
Ligand
BDBM50255695
Substrate
Meas. Tech.
ChEMBL_515273 (CHEMBL991297)
IC50
3±n/a nM
Citation
 Scott, DABalliet, CLCook, DJDavies, AMGero, TWOmer, CAPoondru, STheoclitou, METyurin, BZinda, MJ Identification of 3-amido-4-anilinoquinolines as potent and selective inhibitors of CSF-1R kinase. Bioorg Med Chem Lett 19:697-700 (2009)  
Target
Name:
Macrophage colony-stimulating factor 1 receptor
Synonyms:
CSF1R FMS Macrophage colony stimulating factor receptor Macrophage colony-stimulating factor 1 receptor (c-FMS) Proto-oncogene c-Fms c-fms | cFMS
Type:
Protein
Mol. Mass.:
107979.48
Organism:
Homo sapiens (Human)
Description:
P07333
Residue:
972
  
Inhibitor
Name:
BDBM50255695
Synonyms:
4-(2,3-dichlorophenylamino)-7-(2-(dimethylamino)ethylamino)-6-methoxyquinoline-3-carboxamide | CHEMBL521262
Type:
Small organic molecule
Emp. Form.:
C21H23Cl2N5O2
Mol. Mass.:
448.346
SMILES:
COc1cc2c(Nc3cccc(Cl)c3Cl)c(cnc2cc1NCCN(C)C)C(N)=O
: