Target
Mast/stem cell growth factor receptor Kit
Ligand
BDBM25118
Substrate
Meas. Tech.
ChEMBL_560345 (CHEMBL1009185)
IC50
3±n/a nM
Citation
 Renhowe, PAPecchi, SShafer, CMMachajewski, TDJazan, EMTaylor, CAntonios-McCrea, WMcBride, CMFrazier, KWiesmann, MLapointe, GRFeucht, PHWarne, RLHeise, CCMenezes, DAardalen, KYe, HHe, MLe, VVora, JJansen, JMWernette-Hammond, MEHarris, AL Design, structure-activity relationships and in vivo characterization of 4-amino-3-benzimidazol-2-ylhydroquinolin-2-ones: a novel class of receptor tyrosine kinase inhibitors. J Med Chem 52:278-92 (2009)  
Target
Name:
Mast/stem cell growth factor receptor Kit
Synonyms:
CD117 antigen KIT Mast/stem cell growth factor receptor Kit (cKIT) Proto-oncogene tyrosine-protein kinase Kit Stem cell growth factor receptor Tyrosine-protein kinase Kit c-kit v-kit Hardy-Zuckerman 4 feline sarcoma viral oncogene homolog
Type:
Protein
Mol. Mass.:
109869.37
Organism:
Homo sapiens (Human)
Description:
P10721
Residue:
976
  
Inhibitor
Name:
BDBM25118
Synonyms:
(3Z)-4-amino-5-fluoro-3-[5-(4-methylpiperazino)-1,3-dihydrobenzimidazol-2-ylidene]carbostyril CHEMBL522892 | CHIR-258
Type:
Small organic molecule
Emp. Form.:
C21H21FN6O
Mol. Mass.:
392.4294
SMILES:
CN1CCN(CC1)c1ccc2nc([nH]c2c1)-c1c(N)c2c(F)cccc2[nH]c1=O
: