Target
Macrophage colony-stimulating factor 1 receptor
Ligand
BDBM50255594
Substrate
Meas. Tech.
ChEMBL_515362 (CHEMBL1025517)
IC50
3±n/a nM
Citation
 Scott, DABell, KJCampbell, CTCook, DJDakin, LADel Valle, DJDrew, LGero, TWHattersley, MMOmer, CATyurin, BZheng, X 3-amido-4-anilinoquinolines as CSF-1R kinase inhibitors 2: Optimization of the PK profile. Bioorg Med Chem Lett 19:701-5 (2009)  
Target
Name:
Macrophage colony-stimulating factor 1 receptor
Synonyms:
CSF1R FMS Macrophage colony stimulating factor receptor Macrophage colony-stimulating factor 1 receptor (c-FMS) Proto-oncogene c-Fms c-fms | cFMS
Type:
Protein
Mol. Mass.:
107979.48
Organism:
Homo sapiens (Human)
Description:
P07333
Residue:
972
  
Inhibitor
Name:
BDBM50255594
Synonyms:
4-(2,3-dichlorophenylamino)-7-fluoro-6-(4-methylpiperazin-1-yl)quinoline-3-carboxamide | CHEMBL481401
Type:
Small organic molecule
Emp. Form.:
C21H20Cl2FN5O
Mol. Mass.:
448.321
SMILES:
CN1CCN(CC1)c1cc2c(Nc3cccc(Cl)c3Cl)c(cnc2cc1F)C(N)=O
: