Target
Cytochrome P450 2D6
Ligand
BDBM50255812
Substrate
Meas. Tech.
ChEMBL_515427 (CHEMBL1028886)
IC50
109.4±n/a nM
Citation
 Ponte-Sucre, AGulder, TWegehaupt, AAlbert, CRikanovic, CSchaeflein, LFrank, ASchultheis, MUnger, MHolzgrabe, UBringmann, GMoll, H Structure-activity relationship and studies on the molecular mechanism of leishmanicidal N,C-coupled arylisoquinolinium salts. J Med Chem 52:626-36 (2009)  
Target
Name:
Cytochrome P450 2D6
Synonyms:
CP2D6_HUMAN CYP2DL1 Cytochrome P450 2D6 (CYP2D6) P450-DB1
Type:
Protein
Mol. Mass.:
55774.82
Organism:
Homo sapiens (Human)
Description:
P10635
Residue:
497
  
Inhibitor
Name:
BDBM50255812
Synonyms:
CHEMBL481022 | N-(4'-i-Propylphenyl)-6,8-dimethoxy-1,3-dimethylisoquinoliniumTrifluoroacetate
Type:
Small organic molecule
Emp. Form.:
C22H26NO2
Mol. Mass.:
336.4468
SMILES:
COc1cc(OC)c2c(C)[n+](c(C)cc2c1)-c1ccc(cc1)C(C)C
: